{"text_format":"1","workbook":"xlsx","n_sheets":8,"sheets":["机能单位","WBS","品质","开工率","设定Sheet","日历作成用","变更履历","WBS变更履历"],"not_rendered":{"charts":0,"images":0,"macros":1,"external_links":0,"defined_names":75,"comments":0,"pivot_tables":0},"unopened":[],"bounds":{"document_bytes":16777216,"sheet_cells":100000,"rows_first":2000,"rows_last":500,"rows_between":2000,"halvings":0,"cell_chars":16384,"cell_head_chars":4096},"cells_cut":0,"cells_raw":0,"read":"whole","date_system":"1900"}

{"sheet":"机能单位","index":0,"n_rows":44,"n_cols":25,"rows_kept":44,"cut":false,"hidden":true,"merged":[[24,5,25,5],[26,5,27,5],[4,9,4,12],[4,13,4,16],[4,17,4,20],[4,5,9,5],[10,5,14,5],[15,5,16,5],[17,5,18,5],[19,5,20,5],[23,13,23,16],[23,17,23,20],[38,9,38,12],[38,13,38,16],[38,17,38,20],[38,21,38,24],[4,21,4,24],[23,9,23,12],[23,21,23,24]]}
[]
[]
[]
["ポータル","優先順位","難易度",null,"機能","予定納品日",null,null,null,"ポータル"]
[null,1,"高","新規登録","ログイン","2020-03-10",null,null,null,"2020-02-01",null,null,null,"2020-03-01",null,null,null,"2020-04-01",null,null,null,"2020-05-01"]
[null,null,null,null,"パスワード変更",null,null,null,null,"1週","2週","3週","4週","1週","2週","3週","4週","1週","2週","3週","4週","1週","2週","3週","4週"]
[null,null,null,null,"お知らせ",null,null,null,1]
[null,null,null,null,"お知らせ詳細"]
[null,null,null,null,"メニュー",null,null,null,2]
[null,null,null,null,"ID申請"]
[null,2,"高","契約申請","基本情報登録","2020-03-27",null,null,3]
[null,null,null,"契約変更","約款確認"]
[null,null,null,null,"契約申請",null,null,null,4]
[null,null,null,null,"相場情報配信API"]
[null,null,null,null,"契約確認",null,null,null,5]
[null,3,"中","アクセスキー","アクセスキー変更","2020-03-30"]
[null,null,null,null,"解約"]
[null,4,"低","請求","使用状況","2020-04-07"]
[null,null,null,null,"ご請求"]
[null,5,"中","その他","ID情報変更","2020-03-30"]
{"$rows_left_out":25}
{"sheet":"WBS","index":1,"n_rows":1190,"n_cols":70,"rows_kept":1190,"cut":false,"hidden":false,"merged":[[3,20,3,21],[3,22,3,23],[3,25,3,27]]}
[null,null,null,null,null,null,null,null,null,null,null,null,null,null,null,null,null,null,null,null,null,null,null,null,null,null,null,null,null,null,"进度基准日",{"$f":"TODAY()","v":"2024-09-23"}]
[null,null,null,null,null,null,"组号",null,null,null,null,null,null,null,null,null,null,null,null,null,null,null,null,null,null,null,null,null,null,null,"日历开始日","2024-09-23"]
[null,null,null,null,null,null,1,null,null,null,null,null,null,null,null,null,null,null,null,null,null,null,null,null,null,null,null,null,null,null,"日历结束日","2024-10-30",{"$f":"AG4","v":"2024年\n9月"},"2024年\n9月","2024年\n9月","2024年\n9月","2024年\n9月","2024年\n9月","2024年\n9月","2024年\n9月","2024年\n10月","2024年\n10月","2024年\n10月","2024年\n10月","2024年\n10月","2024年\n10月","2024年\n10月","2024年\n10月","2024年\n10月","2024年\n10月","2024年\n10月","2024年\n10月","2024年\n10月","2024年\n10月","2024年\n10月","2024年\n10月","2024年\n10月","2024年\n10月","2024年\n10月","2024年\n10月","2024年\n10月","2024年\n10月","2024年\n10月","2024年\n10月","2024年\n10月","2024年\n10月","2024年\n10月","2024年\n10月","2024年\n10月","2024年\n10月"]
[null,null,null,null,null,null,null,null,null,null,null,null,null,null,null,null,null,null,null,null,"预定",null,"实际",null,"进度",null,null,null,null,"※自动计算","※自动计算",null,{"$f":"YEAR(AG5)&\"年\"&CHAR(10)&MONTH(AG5)&\"月\"","v":"2024年\n9月"},"2024年\n9月","2024年\n9月","2024年\n9月","2024年\n9月","2024年\n9月","2024年\n9月","2024年\n9月","2024年\n10月","2024年\n10月","2024年\n10月","2024年\n10月","2024年\n10月","2024年\n10月","2024年\n10月","2024年\n10月","2024年\n10月","2024年\n10月","2024年\n10月","2024年\n10月","2024年\n10月","2024年\n10月","2024年\n10月","2024年\n10月","2024年\n10月","2024年\n10月","2024年\n10月","2024年\n10月","2024年\n10月","2024年\n10月","2024年\n10月","2024年\n10月","2024年\n10月","2024年\n10月","2024年\n10月","2024年\n10月","2024年\n10月","2024年\n10月"]
[null,null,null,null,null,null,"WBS号",null,null,null,null,null,null,null,"Task",null,null,null,null,"担当","开始","结束","开始","结束","进度率","实际数","总数","单位","状态","预定作业","延迟天数/","备考","2024-09-23",{"$f":"AG5+1","v":"2024-09-24"},"2024-09-25","2024-09-26","2024-09-27","2024-09-28","2024-09-29","2024-09-30","2024-10-01","2024-10-02","2024-10-03","2024-10-04","2024-10-05","2024-10-06","2024-10-07","2024-10-08","2024-10-09","2024-10-10","2024-10-11","2024-10-12","2024-10-13","2024-10-14","2024-10-15","2024-10-16","2024-10-17","2024-10-18","2024-10-19","2024-10-20","2024-10-21","2024-10-22","2024-10-23","2024-10-24","2024-10-25","2024-10-26","2024-10-27","2024-10-28","2024-10-29","2024-10-30"]
[null,null,null,null,null,null,null,null,null,null,null,null,null,null,null,null,null,null,null,null,null,null,null,null,null,null,null,null,null,"营业天数","超前天数",null,{"$f":"AG5","v":45558},45559,45560,45561,45562,45563,45564,45565,45566,45567,45568,45569,45570,45571,45572,45573,45574,45575,45576,45577,45578,45579,45580,45581,45582,45583,45584,45585,45586,45587,45588,45589,45590,45591,45592,45593,45594,45595]
[null,null,null,null,null,null,null,null,null,null,null,0,0,0,null,null,null,null,null,null,null,null,null,null,null,null,null,null,null,null,null,"土日",{"$f":"IF(OR(WEEKDAY(AG5)=7,WEEKDAY(AG5)=1),1,\"\")","v":""},{"$f":"IF(OR(WEEKDAY(AH5)=7,WEEKDAY(AH5)=1),1,\"\")","v":""},"","","",1,1,"","","","","",1,1,"","","","","",1,1,"","","","","",1,1,"","","","","",1,1,"","",""]
[null,null,null,null,null,null,null,null,null,null,null,0,0,0,null,null,null,null,null,null,null,null,null,null,null,null,null,null,null,null,null,"祝日",{"$f":"IF(ISNA(VLOOKUP(AG$5,设定Sheet!$A$11:$A$396,1,FALSE)),\"\",1)","v":""},{"$f":"IF(ISNA(VLOOKUP(AH$5,设定Sheet!$A$11:$A$396,1,FALSE)),\"\",1)","v":""},{"$f":"IF(ISNA(VLOOKUP(AI$5,设定Sheet!$A$11:$A$396,1,FALSE)),\"\",1)","v":""},{"$f":"IF(ISNA(VLOOKUP(AJ$5,设定Sheet!$A$11:$A$396,1,FALSE)),\"\",1)","v":""},{"$f":"IF(ISNA(VLOOKUP(AK$5,设定Sheet!$A$11:$A$396,1,FALSE)),\"\",1)","v":""},{"$f":"IF(ISNA(VLOOKUP(AL$5,设定Sheet!$A$11:$A$396,1,FALSE)),\"\",1)","v":""},{"$f":"IF(ISNA(VLOOKUP(AM$5,设定Sheet!$A$11:$A$396,1,FALSE)),\"\",1)","v":""},{"$f":"IF(ISNA(VLOOKUP(AN$5,设定Sheet!$A$11:$A$396,1,FALSE)),\"\",1)","v":""},{"$f":"IF(ISNA(VLOOKUP(AO$5,设定Sheet!$A$11:$A$396,1,FALSE)),\"\",1)","v":""},{"$f":"IF(ISNA(VLOOKUP(AP$5,设定Sheet!$A$11:$A$396,1,FALSE)),\"\",1)","v":""},{"$f":"IF(ISNA(VLOOKUP(AQ$5,设定Sheet!$A$11:$A$396,1,FALSE)),\"\",1)","v":""},{"$f":"IF(ISNA(VLOOKUP(AR$5,设定Sheet!$A$11:$A$396,1,FALSE)),\"\",1)","v":""},{"$f":"IF(ISNA(VLOOKUP(AS$5,设定Sheet!$A$11:$A$396,1,FALSE)),\"\",1)","v":""},{"$f":"IF(ISNA(VLOOKUP(AT$5,设定Sheet!$A$11:$A$396,1,FALSE)),\"\",1)","v":""},{"$f":"IF(ISNA(VLOOKUP(AU$5,设定Sheet!$A$11:$A$396,1,FALSE)),\"\",1)","v":""},{"$f":"IF(ISNA(VLOOKUP(AV$5,设定Sheet!$A$11:$A$396,1,FALSE)),\"\",1)","v":""},{"$f":"IF(ISNA(VLOOKUP(AW$5,设定Sheet!$A$11:$A$396,1,FALSE)),\"\",1)","v":""},{"$f":"IF(ISNA(VLOOKUP(AX$5,设定Sheet!$A$11:$A$396,1,FALSE)),\"\",1)","v":""},{"$f":"IF(ISNA(VLOOKUP(AY$5,设定Sheet!$A$11:$A$396,1,FALSE)),\"\",1)","v":""},{"$f":"IF(ISNA(VLOOKUP(AZ$5,设定Sheet!$A$11:$A$396,1,FALSE)),\"\",1)","v":""},{"$f":"IF(ISNA(VLOOKUP(BA$5,设定Sheet!$A$11:$A$396,1,FALSE)),\"\",1)","v":""},{"$f":"IF(ISNA(VLOOKUP(BB$5,设定Sheet!$A$11:$A$396,1,FALSE)),\"\",1)","v":""},{"$f":"IF(ISNA(VLOOKUP(BC$5,设定Sheet!$A$11:$A$396,1,FALSE)),\"\",1)","v":""},{"$f":"IF(ISNA(VLOOKUP(BD$5,设定Sheet!$A$11:$A$396,1,FALSE)),\"\",1)","v":""},{"$f":"IF(ISNA(VLOOKUP(BE$5,设定Sheet!$A$11:$A$396,1,FALSE)),\"\",1)","v":""},{"$f":"IF(ISNA(VLOOKUP(BF$5,设定Sheet!$A$11:$A$396,1,FALSE)),\"\",1)","v":""},{"$f":"IF(ISNA(VLOOKUP(BG$5,设定Sheet!$A$11:$A$396,1,FALSE)),\"\",1)","v":""},{"$f":"IF(ISNA(VLOOKUP(BH$5,设定Sheet!$A$11:$A$396,1,FALSE)),\"\",1)","v":""},{"$f":"IF(ISNA(VLOOKUP(BI$5,设定Sheet!$A$11:$A$396,1,FALSE)),\"\",1)","v":""},{"$f":"IF(ISNA(VLOOKUP(BJ$5,设定Sheet!$A$11:$A$396,1,FALSE)),\"\",1)","v":""},{"$f":"IF(ISNA(VLOOKUP(BK$5,设定Sheet!$A$11:$A$396,1,FALSE)),\"\",1)","v":""},{"$f":"IF(ISNA(VLOOKUP(BL$5,设定Sheet!$A$11:$A$396,1,FALSE)),\"\",1)","v":""},{"$f":"IF(ISNA(VLOOKUP(BM$5,设定Sheet!$A$11:$A$396,1,FALSE)),\"\",1)","v":""},{"$f":"IF(ISNA(VLOOKUP(BN$5,设定Sheet!$A$11:$A$396,1,FALSE)),\"\",1)","v":""},{"$f":"IF(ISNA(VLOOKUP(BO$5,设定Sheet!$A$11:$A$396,1,FALSE)),\"\",1)","v":""},{"$f":"IF(ISNA(VLOOKUP(BP$5,设定Sheet!$A$11:$A$396,1,FALSE)),\"\",1)","v":""},{"$f":"IF(ISNA(VLOOKUP(BQ$5,设定Sheet!$A$11:$A$396,1,FALSE)),\"\",1)","v":""},{"$f":"IF(ISNA(VLOOKUP(BR$5,设定Sheet!$A$11:$A$396,1,FALSE)),\"\",1)","v":""}]
[null,null,null,null,null,null,null,null,null,null,null,0,0,0,null,null,null,null,null,null,null,null,null,null,null,null,null,null,null,null,null,"営業日フラグ",{"$f":"IF(ISNA(VLOOKUP(AG$5,设定Sheet!$B$11:$B$396,1,FALSE)),IF(COUNT(AG7:AG8)>0,\"\",1),1)","v":1},{"$f":"IF(ISNA(VLOOKUP(AH$5,设定Sheet!$B$11:$B$396,1,FALSE)),IF(COUNT(AH7:AH8)>0,\"\",1),1)","v":1},{"$f":"IF(ISNA(VLOOKUP(AI$5,设定Sheet!$B$11:$B$396,1,FALSE)),IF(COUNT(AI7:AI8)>0,\"\",1),1)","v":1},{"$f":"IF(ISNA(VLOOKUP(AJ$5,设定Sheet!$B$11:$B$396,1,FALSE)),IF(COUNT(AJ7:AJ8)>0,\"\",1),1)","v":1},{"$f":"IF(ISNA(VLOOKUP(AK$5,设定Sheet!$B$11:$B$396,1,FALSE)),IF(COUNT(AK7:AK8)>0,\"\",1),1)","v":1},{"$f":"IF(ISNA(VLOOKUP(AL$5,设定Sheet!$B$11:$B$396,1,FALSE)),IF(COUNT(AL7:AL8)>0,\"\",1),1)","v":""},{"$f":"IF(ISNA(VLOOKUP(AM$5,设定Sheet!$B$11:$B$396,1,FALSE)),IF(COUNT(AM7:AM8)>0,\"\",1),1)","v":""},{"$f":"IF(ISNA(VLOOKUP(AN$5,设定Sheet!$B$11:$B$396,1,FALSE)),IF(COUNT(AN7:AN8)>0,\"\",1),1)","v":1},{"$f":"IF(ISNA(VLOOKUP(AO$5,设定Sheet!$B$11:$B$396,1,FALSE)),IF(COUNT(AO7:AO8)>0,\"\",1),1)","v":1},{"$f":"IF(ISNA(VLOOKUP(AP$5,设定Sheet!$B$11:$B$396,1,FALSE)),IF(COUNT(AP7:AP8)>0,\"\",1),1)","v":1},{"$f":"IF(ISNA(VLOOKUP(AQ$5,设定Sheet!$B$11:$B$396,1,FALSE)),IF(COUNT(AQ7:AQ8)>0,\"\",1),1)","v":1},{"$f":"IF(ISNA(VLOOKUP(AR$5,设定Sheet!$B$11:$B$396,1,FALSE)),IF(COUNT(AR7:AR8)>0,\"\",1),1)","v":1},{"$f":"IF(ISNA(VLOOKUP(AS$5,设定Sheet!$B$11:$B$396,1,FALSE)),IF(COUNT(AS7:AS8)>0,\"\",1),1)","v":""},{"$f":"IF(ISNA(VLOOKUP(AT$5,设定Sheet!$B$11:$B$396,1,FALSE)),IF(COUNT(AT7:AT8)>0,\"\",1),1)","v":""},{"$f":"IF(ISNA(VLOOKUP(AU$5,设定Sheet!$B$11:$B$396,1,FALSE)),IF(COUNT(AU7:AU8)>0,\"\",1),1)","v":1},{"$f":"IF(ISNA(VLOOKUP(AV$5,设定Sheet!$B$11:$B$396,1,FALSE)),IF(COUNT(AV7:AV8)>0,\"\",1),1)","v":1},{"$f":"IF(ISNA(VLOOKUP(AW$5,设定Sheet!$B$11:$B$396,1,FALSE)),IF(COUNT(AW7:AW8)>0,\"\",1),1)","v":1},{"$f":"IF(ISNA(VLOOKUP(AX$5,设定Sheet!$B$11:$B$396,1,FALSE)),IF(COUNT(AX7:AX8)>0,\"\",1),1)","v":1},{"$f":"IF(ISNA(VLOOKUP(AY$5,设定Sheet!$B$11:$B$396,1,FALSE)),IF(COUNT(AY7:AY8)>0,\"\",1),1)","v":1},{"$f":"IF(ISNA(VLOOKUP(AZ$5,设定Sheet!$B$11:$B$396,1,FALSE)),IF(COUNT(AZ7:AZ8)>0,\"\",1),1)","v":""},{"$f":"IF(ISNA(VLOOKUP(BA$5,设定Sheet!$B$11:$B$396,1,FALSE)),IF(COUNT(BA7:BA8)>0,\"\",1),1)","v":""},{"$f":"IF(ISNA(VLOOKUP(BB$5,设定Sheet!$B$11:$B$396,1,FALSE)),IF(COUNT(BB7:BB8)>0,\"\",1),1)","v":1},{"$f":"IF(ISNA(VLOOKUP(BC$5,设定Sheet!$B$11:$B$396,1,FALSE)),IF(COUNT(BC7:BC8)>0,\"\",1),1)","v":1},{"$f":"IF(ISNA(VLOOKUP(BD$5,设定Sheet!$B$11:$B$396,1,FALSE)),IF(COUNT(BD7:BD8)>0,\"\",1),1)","v":1},{"$f":"IF(ISNA(VLOOKUP(BE$5,设定Sheet!$B$11:$B$396,1,FALSE)),IF(COUNT(BE7:BE8)>0,\"\",1),1)","v":1},{"$f":"IF(ISNA(VLOOKUP(BF$5,设定Sheet!$B$11:$B$396,1,FALSE)),IF(COUNT(BF7:BF8)>0,\"\",1),1)","v":1},{"$f":"IF(ISNA(VLOOKUP(BG$5,设定Sheet!$B$11:$B$396,1,FALSE)),IF(COUNT(BG7:BG8)>0,\"\",1),1)","v":""},{"$f":"IF(ISNA(VLOOKUP(BH$5,设定Sheet!$B$11:$B$396,1,FALSE)),IF(COUNT(BH7:BH8)>0,\"\",1),1)","v":""},{"$f":"IF(ISNA(VLOOKUP(BI$5,设定Sheet!$B$11:$B$396,1,FALSE)),IF(COUNT(BI7:BI8)>0,\"\",1),1)","v":1},{"$f":"IF(ISNA(VLOOKUP(BJ$5,设定Sheet!$B$11:$B$396,1,FALSE)),IF(COUNT(BJ7:BJ8)>0,\"\",1),1)","v":1},{"$f":"IF(ISNA(VLOOKUP(BK$5,设定Sheet!$B$11:$B$396,1,FALSE)),IF(COUNT(BK7:BK8)>0,\"\",1),1)","v":1},{"$f":"IF(ISNA(VLOOKUP(BL$5,设定Sheet!$B$11:$B$396,1,FALSE)),IF(COUNT(BL7:BL8)>0,\"\",1),1)","v":1},{"$f":"IF(ISNA(VLOOKUP(BM$5,设定Sheet!$B$11:$B$396,1,FALSE)),IF(COUNT(BM7:BM8)>0,\"\",1),1)","v":1},{"$f":"IF(ISNA(VLOOKUP(BN$5,设定Sheet!$B$11:$B$396,1,FALSE)),IF(COUNT(BN7:BN8)>0,\"\",1),1)","v":""},{"$f":"IF(ISNA(VLOOKUP(BO$5,设定Sheet!$B$11:$B$396,1,FALSE)),IF(COUNT(BO7:BO8)>0,\"\",1),1)","v":""},{"$f":"IF(ISNA(VLOOKUP(BP$5,设定Sheet!$B$11:$B$396,1,FALSE)),IF(COUNT(BP7:BP8)>0,\"\",1),1)","v":1},{"$f":"IF(ISNA(VLOOKUP(BQ$5,设定Sheet!$B$11:$B$396,1,FALSE)),IF(COUNT(BQ7:BQ8)>0,\"\",1),1)","v":1},{"$f":"IF(ISNA(VLOOKUP(BR$5,设定Sheet!$B$11:$B$396,1,FALSE)),IF(COUNT(BR7:BR8)>0,\"\",1),1)","v":1}]
[null,null,null,null,null,null,null,null,null,null,null,0,0,0,null,null,null,null,null,null,null,null,null,null,null,null,null,null,null,null,null,"初日フラグ",{"$f":"IF(DAY(AG5)=1,1,\"\")","v":""},{"$f":"IF(DAY(AH5)=1,1,\"\")","v":""},"","","","","","",1,"","","","","","","","","","","","","","","","","","","","","","","","","","","","",""]
[null,null,null,null,null,null,null,null,null,null,null,0,0,0,null,null,null,null,null,null,null,null,null,null,null,null,null,null,"ステータス選択肢"]
[null,null,null,null,null,null,null,null,null,null,null,0,0,0,null,null,null,null,null,null,null,null,null,null,null,null,null,null,"未开始"]
[null,null,null,null,null,null,null,null,null,null,null,0,0,0,null,null,null,null,null,null,null,null,null,null,null,null,null,null,"作业中"]
[null,null,null,null,null,null,null,null,null,null,null,0,0,0,null,null,null,null,null,null,null,null,null,null,null,null,null,null,"评审中"]
[null,null,null,null,null,null,null,null,null,null,null,0,0,0,null,null,null,null,null,null,null,null,null,null,null,null,null,null,"指摘对应中"]
[null,null,null,null,null,null,null,null,null,null,null,0,0,0,null,null,null,null,null,null,null,null,null,null,null,null,null,null,"完成"]
[null,null,null,null,null,null,null,null,null,null,null,0,0,0,null,null,null,null,null,null,null,null,null,null,null,null,null,null,"没对应"]
[null,null,null,null,null,null,null,null,null,null,null,0,0,0]
[null,null,null,null,null,null,null,null,null,null,null,0,0,0]
[null,null,null,null,null,null,null,null,null,null,null,0,0,0]
{"$rows_left_out":1171}
{"sheet":"品质","index":2,"n_rows":1442,"n_cols":46,"rows_kept":1442,"cut":false,"hidden":true,"merged":[[3,41,3,45],[3,20,3,21],[3,22,3,23],[3,25,3,27],[3,34,3,35],[3,38,3,39]]}
[null,null,null,null,null,null,null,null,null,null,null,null,null,null,null,null,null,null,null,null,null,null,null,null,null,null,null,null,null,null,"進捗基準日","2020-02-24"]
[null,null,null,null,null,null,"チーム番号",null,null,null,null,null,null,null,null,null,null,null,null,null,null,null,null,null,null,null,null,null,null,null,"カレンダー\n開始日","2020-02-01"]
[null,null,null,null,null,null,4,null,null,null,null,null,null,null,null,null,null,null,null,null,null,null,null,null,null,null,null,null,null,null,"カレンダー\n終了日","2020-04-30"]
[null,null,null,null,null,null,null,null,null,null,null,null,null,null,null,null,null,null,null,null,"予定",null,"実績",null,"進捗",null,null,null,null,"※自動入力","※自動入力",null,null,null,"QA",null,"進捗",null,"ソースレビュー",null,null,"単体試験"]
[null,null,null,null,null,null,"WBS番号",null,null,null,null,null,null,null,"Task",null,null,null,null,"担当","開始","完了","開始","完了","進捗率","実績数","総数","単位","ｽﾃｰﾀｽ","作業予定","遅延日数/","備考","規模",null,"発生","解決","進捗率",null,"不良","不良密度",null,"試験","消化","不良","進捗率","不良密度"]
[null,null,null,null,null,null,null,null,null,null,null,null,null,null,null,null,null,null,null,null,null,null,null,null,null,null,null,null,null,"営業日数","前倒し日数",null,"Ks",null,"件数","件数",null,null,"件数","(件/ks)",null,"件数","件数","件数",null,"(件/ks)"]
[null,null,null,null,null,null,null,null,null,null,null,0,0,0,null,null,null,null,null,null,null,null,null,null,null,null,null,null,null,null,null,"土日"]
[null,null,null,null,null,null,null,null,null,null,null,0,0,0,null,null,null,null,null,null,null,null,null,null,null,null,null,null,null,null,null,"祝日"]
[null,null,null,null,null,null,null,null,null,null,null,0,0,0,null,null,null,null,null,null,null,null,null,null,null,null,null,null,null,null,null,"営業日フラグ"]
[null,null,null,null,null,null,null,null,null,null,null,0,0,0,null,null,null,null,null,null,null,null,null,null,null,null,null,null,null,null,null,"初日フラグ"]
[null,null,null,null,null,null,null,null,null,null,null,0,0,0,null,null,null,null,null,null,null,null,null,null,null,null,null,null,"ステータス選択肢"]
[null,null,null,null,null,null,null,null,null,null,null,0,0,0,null,null,null,null,null,null,null,null,null,null,null,null,null,null,"未着手"]
[null,null,null,null,null,null,null,null,null,null,null,0,0,0,null,null,null,null,null,null,null,null,null,null,null,null,null,null,"作業中"]
[null,null,null,null,null,null,null,null,null,null,null,0,0,0,null,null,null,null,null,null,null,null,null,null,null,null,null,null,"レビュー待ち"]
[null,null,null,null,null,null,null,null,null,null,null,0,0,0,null,null,null,null,null,null,null,null,null,null,null,null,null,null,"指摘対応中"]
[null,null,null,null,null,null,null,null,null,null,null,0,0,0,null,null,null,null,null,null,null,null,null,null,null,null,null,null,"完了"]
[null,null,null,null,null,null,null,null,null,null,null,0,0,0,null,null,null,null,null,null,null,null,null,null,null,null,null,null,"対応なし"]
[null,null,null,null,null,null,null,null,null,null,null,0,0,0]
[null,null,null,null,null,null,null,null,null,null,null,0,0,0]
[null,null,null,null,null,null,null,null,null,null,null,0,0,0]
{"$rows_left_out":1423}
{"sheet":"开工率","index":3,"n_rows":7,"n_cols":40,"rows_kept":7,"cut":false,"hidden":true,"merged":[]}
[]
[]
[]
[null,null,"2020-02-10","2020-02-11","2020-02-12","2020-02-13","2020-02-14","2020-02-15","2020-02-16","2020-02-17","2020-02-18","2020-02-19","2020-02-20","2020-02-21","2020-02-22","2020-02-23","2020-02-24","2020-02-25","2020-02-26","2020-02-27","2020-02-28","2020-02-29","2020-03-01","2020-03-02","2020-03-03","2020-03-04","2020-03-05","2020-03-06","2020-03-07","2020-03-08","2020-03-09","2020-03-10","2020-03-11","2020-03-12","2020-03-13","2020-03-14","2020-03-15","2020-03-16","…","４月１週"]
[null,"見積予定人数",8,8,8,8,8,8,8,8,8,8,8,8,8,8,8,8,8,8,8,8,8,8,8,8,8,8,8,8,8,8,8,8,8,8,8,8,"～","-"]
[null,"稼働予測人数",5,9,12,12,12,12,12,12,12,12,12,12,12,12,12,12,12,12,12,12,12,12,12,12,12,12,12,12,12,12,12,12,12,12,12,12,"～",12]
[null,"稼働実際人数",5,9,9,9,9,null,null,10,10,10,10,12,null,null,11,11,11,12,12,12]

{"sheet":"设定Sheet","index":4,"n_rows":99,"n_cols":19,"rows_kept":99,"cut":false,"hidden":true,"merged":[]}
[]
["预定线"]
["实际线"]
["闪电线色"]
["闪电线粗细",2.5]
[]
[{"$f":"IF(C7<>\"\",1,IF(D7<>\"\",2,IF(E7<>\"\",3,IF(F7<>\"\",4,IF(G7<>\"\",5,\"\")))))","v":""},{"$f":"IF($A7<>\"\",MAX($B6:$B$23)+1,\"\")","v":""},null,null,null,null,null,null,null,null,null,null,null,null,null,null,null,{"$f":"IF(AND($I7>0,$J7>0),SUMIFS($9:$9,$5:$5,\">=\"&$I7,$5:$5,\"<=\"&$J7),\"\")","v":""},{"$f":"IF(AND($R7<>\"\",$R7>=0),IF(AND($M7=1,$J7<单元格_进度基准日-1),0,$R7*$M7-SUMIFS($9:$9,$5:$5,\">=\"&$I7,$5:$5,\"<=\"&单元格_进度基准日-1)),\"\")","v":""}]
["↑公式","↑公式",null,null,null,null,null,null,null,null,null,null,null,null,null,null,null,"↑公式","↑公式"]
[]
["休息日列表","营业日列表"]
["2019-08-11"]
["2019-09-16"]
["2019-09-23"]
["2019-10-14"]
["2019-10-22"]
["2019-11-04"]
["2019-11-22"]
["2019-12-30"]
["2019-12-31"]
["2020-01-01"]
{"$rows_left_out":80}
{"sheet":"日历作成用","index":5,"n_rows":10,"n_cols":2,"rows_kept":10,"cut":false,"hidden":true,"merged":[]}
[]
[]
[{"$f":"A4","v":"1900年\n1月"}]
[{"$f":"YEAR(A5)&\"年\"&CHAR(10)&MONTH(A5)&\"月\"","v":"1900年\n1月"},"1900年\n1月"]
[{"$f":"$T$2","v":"00:00:00"},{"$f":"A5+1","v":"1900-01-01"}]
[{"$f":"A5","v":0},{"$f":"B5","v":1}]
[{"$f":"IF(OR(WEEKDAY(A5)=7,WEEKDAY(A5)=1),1,\"\")","v":1},{"$f":"IF(OR(WEEKDAY(B5)=7,WEEKDAY(B5)=1),1,\"\")","v":1}]
[{"$f":"IF(ISNA(VLOOKUP(A$5,设定Sheet!$A$11:$A$396,1,FALSE)),\"\",1)","v":""},{"$f":"IF(ISNA(VLOOKUP(B$5,设定Sheet!$A$11:$A$396,1,FALSE)),\"\",1)","v":""}]
[{"$f":"IF(ISNA(VLOOKUP(A$5,设定Sheet!$B$11:$B$396,1,FALSE)),IF(COUNT(A7:A8)>0,\"\",1),1)","v":""},{"$f":"IF(ISNA(VLOOKUP(B$5,设定Sheet!$B$11:$B$396,1,FALSE)),IF(COUNT(B7:B8)>0,\"\",1),1)","v":""}]
[{"$f":"IF(DAY(A5)=1,1,\"\")","v":""},{"$f":"IF(DAY(B5)=1,1,\"\")","v":1}]

{"sheet":"变更履历","index":6,"n_rows":6,"n_cols":3,"rows_kept":6,"cut":false,"hidden":true,"merged":[]}
[]
["変更日","変更者","対応内容"]
["2016-01-29","浅野","インデントに応じて行の色がつくように変更"]
["2016-07-06","上野","遅延日数と稲妻線のズレがなくなるように改修"]
["2016-07-06","上野","拡大縮小時の稲妻線のズレがなくなるように改修"]
["2017-01-17","浅野","2017年の祝日データを追加"]

{"sheet":"WBS变更履历","index":7,"n_rows":7,"n_cols":3,"rows_kept":7,"cut":false,"hidden":true,"merged":[]}
[]
["変更日","変更者","対応内容"]
["2019-12-11","ランド","列「基本設計別途対応課題」、「課題内容」を追加"]
["2019-12-11","ランド","基本設計の別途対応課題有りの設計書を前半へ変更\n\nID申請画面\nID情報変更画面\n使用状況確認画面"]
["2019-12-11","ランド","基本設計の別途対応課題無しの設計書を後半へ変更\n\nパスワード変更画面\nパスワードリマインダー画面\nお知らせ詳細画面"]
["2019-12-11","ランド","計画Sheetに漏れていた設計書を追記\n\n定数設計\n項目説明仕様\n適時開示（インデックス）配信API"]
["2019-12-11","ランド","＜契約者ポータル編＞の定数設計の作成スケジュールを変更"]